3
0.982613 0.000537566 0.0168492
0.42733 0.558684 0.0139863
0.000398442 0.176117 0.823485
0.675536 0.313609 0.0108544
0.116199 0.344803 0.538999
0.0564949 0.876591 0.0669139
0.394458 0.249993 0.355549
0.049797 0.676548 0.273655
0.0252777 0.284857 0.689865
0.0354258 0.964504 7.04986e-05
0.530223 0.275949 0.193827
0.425981 0.186293 0.387726
0.177572 0.302024 0.520404
0.10033 0.68497 0.2147
0.295803 0.00464626 0.699551
0.171145 0.420813 0.408042
0.635516 0.0588199 0.305664
0.110929 0.880968 0.0081026
0.124676 0.726938 0.148386
0.850161 0.0485128 0.101327
0.465916 0.00961329 0.52447
0.0185612 0.461879 0.51956
0.0271729 0.462754 0.510073
0.676984 0.0702767 0.252739
0.770928 0.228961 0.000111496
0.954871 0.0187679 0.0263615
0.192608 0.67142 0.135971
0.0156886 0.40001 0.584302
0.188315 0.0148647 0.796821
0.039066 0.326199 0.634735
0.298176 0.700772 0.00105226
0.467529 0.176848 0.355623
0.585118 0.301877 0.113006
0.0399689 0.0928491 0.867182
0.865452 0.109519 0.0250289
0.819187 0.0485309 0.132282
0.887879 0.000132336 0.111989
0.00438282 0.0516206 0.943997
0.232509 0.520217 0.247274
0.149683 0.839886 0.0104312
0.828783 0.0563236 0.114893
0.0831121 0.0167372 0.900151
0.075007 0.575409 0.349584
0.534931 0.429975 0.0350943
0.698823 0.251248 0.0499286
0.0112394 0.00176657 0.986994
0.914237 0.0077104 0.0780522
0.0242322 0.00897307 0.966795
0.0963073 0.0507315 0.852961
0.673029 0.0151448 0.311826
0.560211 0.289859 0.14993
0.950087 0.0162259 0.033687
0.022589 0.909931 0.0674799
0.489469 0.502297 0.00823304
0.0509411 0.202954 0.746105
0.239692 0.639681 0.120627
0.253288 0.0282539 0.718458
0.0666768 0.278149 0.655174
0.102789 0.129124 0.768087
0.480844 0.453339 0.0658171
0.0681144 0.196044 0.735841
0.0109192 0.72998 0.259101
0.85509 0.0343642 0.110545
0.393336 0.16241 0.444254
0.322626 0.496884 0.180489
0.014051 0.849279 0.13667
0.0717004 0.922059 0.0062406
0.0115809 0.143666 0.844753
0.00246235 0.859406 0.138131
0.263337 0.680372 0.0562906
0.885949 0.0693687 0.0446823
0.756987 0.120431 0.122582
0.231294 0.440741 0.327965
0.552013 0.42868 0.0193074
0.0188838 0.808277 0.172839
0.646167 0.0795258 0.274307
0.072197 0.645828 0.281975
0.0101525 0.235618 0.75423
0.00160314 0.0823938 0.916003
0.00601501 0.868487 0.125498
0.198659 0.567742 0.233598
0.181728 0.111012 0.70726
0.509336 0.460185 0.030479
0.930854 0.0688388 0.000307281
0.127433 0.812965 0.059602
0.0884835 0.91005 0.00146642
0.0532296 0.569097 0.377674
0.24585 0.0840616 0.670088
0.320753 0.234203 0.445044
0.067099 0.836432 0.0964695
0.416617 0.112764 0.470619
0.798463 0.158243 0.0432938
0.00417914 0.673986 0.321835
0.185863 0.173531 0.640606
0.0433979 0.0148423 0.94176
0.536197 0.149685 0.314118
0.799138 0.0636785 0.137184
0.733004 0.0828305 0.184166
0.799465 0.0382875 0.162247
0.405853 0.477625 0.116523
