3
0.342689 0.0220952 0.635216
0.227913 0.174063 0.598023
0.439539 0.208755 0.351706
0.00412777 0.0598599 0.936012
0.447568 0.539223 0.0132091
0.127319 0.728235 0.144446
0.225834 0.699859 0.0743077
0.727646 0.112342 0.160012
0.0305204 0.538887 0.430592
0.261567 0.710096 0.0283368
0.0706993 0.926812 0.00248847
0.0567188 0.00284235 0.940439
0.456331 0.443569 0.1001
0.986157 0.00436654 0.00947636
0.629282 0.152434 0.218284
0.788921 0.0161033 0.194976
0.751905 0.212956 0.0351385
0.00347022 0.942965 0.0535651
0.00555004 0.043035 0.951415
7.48888e-05 0.816563 0.183363
